Reaction Details
TargetAdenosine receptor A2b
LigandBDBM50041599
Substrate/Competitorn/a
Meas. Tech.ChEMBL_30604 (CHEMBL642011)
Ki 520±n/a nM
Citation Hayallah, AMSandoval-Ramírez, JReith, USchobert, UPreiss, BSchumacher, BDaly, JWMüller, CE 1,8-disubstituted xanthine derivatives: synthesis of potent A2B-selective adenosine receptor antagonists. J Med Chem45:1500-10 (2002) Adenosine receptor A2b
Name:Adenosine receptor A2b
Type:G Protein-Coupled Receptor (GPCR)
Mol. Mass.:36341.22
Organism:Homo sapiens (Human)
Description:n/a
Residue:332
BDBM50041599
NameBDBM50041599
Synonyms:3-Methyl-6-phenyl-1,5-dihydro-pyrrolo[3,2-d]pyrimidine-2,4-dione | CHEMBL284991
TypeSmall organic molecule
Emp. Form.C13H11N3O2
Mol. Mass.241.2453
SMILESCn1c(=O)[nH]c2cc([nH]c2c1=O)-c1ccccc1