Reaction Details
TargetAdenosine receptor A3
LigandBDBM50110978
Substrate/Competitorn/a
Meas. Tech.ChEMBL_29891 (CHEMBL641962)
Ki 477±n/a nM
Citation Hayallah, AMSandoval-Ramírez, JReith, USchobert, UPreiss, BSchumacher, BDaly, JWMüller, CE 1,8-disubstituted xanthine derivatives: synthesis of potent A2B-selective adenosine receptor antagonists. J Med Chem45:1500-10 (2002) Adenosine receptor A3
Name:Adenosine receptor A3
Type:G Protein-Coupled Receptor (GPCR)
Mol. Mass.:36197.32
Organism:Homo sapiens (Human)
Description:P0DMS8
Residue:318
BDBM50110978
NameBDBM50110978
Synonyms:8-(4-Bromo-phenyl)-1-prop-2-ynyl-3,7-dihydro-purine-2,6-dione | CHEMBL286527
TypeSmall organic molecule
Emp. Form.C14H9BrN4O2
Mol. Mass.345.151
SMILESBrc1ccc(cc1)-c1nc2[nH]c(=O)n(CC#C)c(=O)c2[nH]1