Reaction Details
TargetAdenosine receptor A1
LigandBDBM50110981
Substrate/Competitorn/a
Meas. Tech.ChEMBL_29625 (CHEMBL636643)
Ki 2200±n/a nM
Citation Hayallah, AMSandoval-Ramírez, JReith, USchobert, UPreiss, BSchumacher, BDaly, JWMüller, CE 1,8-disubstituted xanthine derivatives: synthesis of potent A2B-selective adenosine receptor antagonists. J Med Chem45:1500-10 (2002) Adenosine receptor A1
Name:Adenosine receptor A1
Type:Protein
Mol. Mass.:36704.13
Organism:Rattus norvegicus (rat)
Description:n/a
Residue:326
BDBM50110981
NameBDBM50110981
Synonyms:CHEMBL34862 Potassium; 4-(2,6-dioxo-1-propyl-2,3,6,7-tetrahydro-1H-purin-8-yl)-benzenesulfonate(PSB-1115)
TypeSmall organic molecule
Emp. Form.C14H13N4O5S
Mol. Mass.349.342
SMILESCCCn1c(=O)[nH]c2nc([nH]c2c1=O)-c1ccc(cc1)S([O-])(=O)=O