Reaction Details
TargetAdenosine receptor A3
LigandBDBM50110972
Substrate/Competitorn/a
Meas. Tech.ChEMBL_29891 (CHEMBL641962)
Ki 1119±n/a nM
Citation Hayallah, AMSandoval-Ramírez, JReith, USchobert, UPreiss, BSchumacher, BDaly, JWMüller, CE 1,8-disubstituted xanthine derivatives: synthesis of potent A2B-selective adenosine receptor antagonists. J Med Chem45:1500-10 (2002) Adenosine receptor A3
Name:Adenosine receptor A3
Type:G Protein-Coupled Receptor (GPCR)
Mol. Mass.:36197.32
Organism:Homo sapiens (Human)
Description:P0DMS8
Residue:318
BDBM50110972
NameBDBM50110972
Synonyms:3-[4-(2,6-Dioxo-1-propyl-2,3,6,7-tetrahydro-1H-purin-8-yl)-phenyl]-acrylic acid methyl ester | CHEMBL289516
TypeSmall organic molecule
Emp. Form.C18H18N4O4
Mol. Mass.354.3599
SMILESCCCn1c(=O)[nH]c2nc([nH]c2c1=O)-c1ccc(C=CC(=O)OC)cc1