Reaction Details
TargetAdenosine receptor A2a
LigandBDBM50110983
Substrate/Competitorn/a
Meas. Tech.ChEMBL_30137 (CHEMBL641340)
Ki 450±n/a nM
Citation Hayallah, AMSandoval-Ramírez, JReith, USchobert, UPreiss, BSchumacher, BDaly, JWMüller, CE 1,8-disubstituted xanthine derivatives: synthesis of potent A2B-selective adenosine receptor antagonists. J Med Chem45:1500-10 (2002) Adenosine receptor A2a
Name:Adenosine receptor A2a
Type:G Protein-Coupled Receptor (GPCR)
Mol. Mass.:45015.65
Organism:Rattus norvegicus (rat)
Description:Rat A2A receptors expressed in CHO cells.
Residue:410
BDBM50110983
NameBDBM50110983
Synonyms:8-{4-[2-(4-Acetyl-piperazin-1-yl)-2-oxo-ethoxy]-phenyl}-1-butyl-3,7-dihydro-purine-2,6-dione | CHEMBL37050
TypeSmall organic molecule
Emp. Form.C23H28N6O5
Mol. Mass.468.5056
SMILESCCCCn1c(=O)[nH]c2nc([nH]c2c1=O)-c1ccc(OCC(=O)N2CCN(CC2)C(C)=O)cc1