Reaction Details
TargetAdenosine receptor A2a
LigandBDBM50110986
Substrate/Competitorn/a
Meas. Tech.ChEMBL_30137 (CHEMBL641340)
Ki 365±n/a nM
Citation Hayallah, AMSandoval-Ramírez, JReith, USchobert, UPreiss, BSchumacher, BDaly, JWMüller, CE 1,8-disubstituted xanthine derivatives: synthesis of potent A2B-selective adenosine receptor antagonists. J Med Chem45:1500-10 (2002) Adenosine receptor A2a
Name:Adenosine receptor A2a
Type:G Protein-Coupled Receptor (GPCR)
Mol. Mass.:45015.65
Organism:Rattus norvegicus (rat)
Description:Rat A2A receptors expressed in CHO cells.
Residue:410
BDBM50110986
NameBDBM50110986
Synonyms:CHEMBL288459 | N-(2-Amino-ethyl)-2-[4-(2,6-dioxo-1-propyl-2,3,6,7-tetrahydro-1H-purin-8-yl)-phenoxy]-acetamide
TypeSmall organic molecule
Emp. Form.C18H22N6O4
Mol. Mass.386.4051
SMILESCCCn1c(=O)[nH]c2nc([nH]c2c1=O)-c1ccc(OCC(=O)NCCN)cc1