Reaction Details
TargetAdenosine receptor A3
LigandBDBM50042205
Substrate/Competitorn/a
Meas. Tech.ChEMBL_29891 (CHEMBL641962)
Ki 950±n/a nM
Citation Hayallah, AMSandoval-Ramírez, JReith, USchobert, UPreiss, BSchumacher, BDaly, JWMüller, CE 1,8-disubstituted xanthine derivatives: synthesis of potent A2B-selective adenosine receptor antagonists. J Med Chem45:1500-10 (2002) Adenosine receptor A3
Name:Adenosine receptor A3
Type:G Protein-Coupled Receptor (GPCR)
Mol. Mass.:36197.32
Organism:Homo sapiens (Human)
Description:P0DMS8
Residue:318
BDBM50042205
NameBDBM50042205
Synonyms:1-Ethyl-8-phenyl-3,7-dihydro-purine-2,6-dione | CHEMBL287129
TypeSmall organic molecule
Emp. Form.C13H12N4O2
Mol. Mass.256.26
SMILESCCn1c(=O)[nH]c2nc([nH]c2c1=O)-c1ccccc1