Reaction Details
TargetAdenosine receptor A1
LigandBDBM50110974
Substrate/Competitorn/a
Meas. Tech.ChEMBL_29625 (CHEMBL636643)
Ki 210±n/a nM
Citation Hayallah, AMSandoval-Ramírez, JReith, USchobert, UPreiss, BSchumacher, BDaly, JWMüller, CE 1,8-disubstituted xanthine derivatives: synthesis of potent A2B-selective adenosine receptor antagonists. J Med Chem45:1500-10 (2002) Adenosine receptor A1
Name:Adenosine receptor A1
Type:Protein
Mol. Mass.:36704.13
Organism:Rattus norvegicus (rat)
Description:n/a
Residue:326
BDBM50110974
NameBDBM50110974
Synonyms:CHEMBL435575 | Potassium; 4-(2,6-dioxo-1,3-dipropyl-2,3,6,7-tetrahydro-1H-purin-8-yl)-benzenesulfonate(DPSPX)
TypeSmall organic molecule
Emp. Form.C17H19N4O5S
Mol. Mass.391.422
SMILESCCCn1c2nc([nH]c2c(=O)n(CCC)c1=O)-c1ccc(cc1)S([O-])(=O)=O