Reaction Details
TargetAdenosine receptor A2b
LigandBDBM50110987
Substrate/Competitorn/a
Meas. Tech.ChEMBL_30604 (CHEMBL642011)
Ki 13±n/a nM
Citation Hayallah, AMSandoval-Ramírez, JReith, USchobert, UPreiss, BSchumacher, BDaly, JWMüller, CE 1,8-disubstituted xanthine derivatives: synthesis of potent A2B-selective adenosine receptor antagonists. J Med Chem45:1500-10 (2002) Adenosine receptor A2b
Name:Adenosine receptor A2b
Type:G Protein-Coupled Receptor (GPCR)
Mol. Mass.:36341.22
Organism:Homo sapiens (Human)
Description:n/a
Residue:332
BDBM50110987
NameBDBM50110987
Synonyms:6-(2,6-Dioxo-1-propyl-2,3,6,7-tetrahydro-1H-purin-8-yl)-naphthalene-2-carboxylic acid | CHEMBL286350
TypeSmall organic molecule
Emp. Form.C19H16N4O4
Mol. Mass.364.3547
SMILESCCCn1c(=O)[nH]c2nc([nH]c2c1=O)-c1ccc2cc(ccc2c1)C(O)=O