Reaction Details
TargetAdenosine receptor A1
LigandBDBM50042214
Substrate/Competitorn/a
Meas. Tech.ChEMBL_29625 (CHEMBL636643)
Ki 2500±n/a nM
Citation Hayallah, AMSandoval-Ramírez, JReith, USchobert, UPreiss, BSchumacher, BDaly, JWMüller, CE 1,8-disubstituted xanthine derivatives: synthesis of potent A2B-selective adenosine receptor antagonists. J Med Chem45:1500-10 (2002) Adenosine receptor A1
Name:Adenosine receptor A1
Type:Protein
Mol. Mass.:36704.13
Organism:Rattus norvegicus (rat)
Description:n/a
Residue:326
BDBM50042214
NameBDBM50042214
Synonyms:8-Phenyl-3,7-dihydro-purine-2,6-dione | CHEMBL285191
TypeSmall organic molecule
Emp. Form.C11H8N4O2
Mol. Mass.228.2068
SMILESO=c1[nH]c2nc([nH]c2c(=O)[nH]1)-c1ccccc1