Reaction Details
TargetAdenosine receptor A2a
LigandBDBM50018152
Substrate/Competitorn/a
Meas. Tech.ChEMBL_30137 (CHEMBL641340)
Ki 458±n/a nM
Citation Hayallah, AMSandoval-Ramírez, JReith, USchobert, UPreiss, BSchumacher, BDaly, JWMüller, CE 1,8-disubstituted xanthine derivatives: synthesis of potent A2B-selective adenosine receptor antagonists. J Med Chem45:1500-10 (2002) Adenosine receptor A2a
Name:Adenosine receptor A2a
Type:G Protein-Coupled Receptor (GPCR)
Mol. Mass.:45015.65
Organism:Rattus norvegicus (rat)
Description:Rat A2A receptors expressed in CHO cells.
Residue:410
BDBM50018152
NameBDBM50018152
Synonyms:8-Phenyl-1-propyl-3,7-dihydro-purine-2,6-dione | CHEMBL274855
TypeSmall organic molecule
Emp. Form.C14H14N4O2
Mol. Mass.270.2866
SMILESCCCn1c(=O)[nH]c2nc([nH]c2c1=O)-c1ccccc1