Reaction Details
TargetAdenosine receptor A2b
LigandBDBM50110988
Substrate/Competitorn/a
Meas. Tech.ChEMBL_30604 (CHEMBL642011)
Ki 372±n/a nM
Citation Hayallah, AMSandoval-Ramírez, JReith, USchobert, UPreiss, BSchumacher, BDaly, JWMüller, CE 1,8-disubstituted xanthine derivatives: synthesis of potent A2B-selective adenosine receptor antagonists. J Med Chem45:1500-10 (2002) Adenosine receptor A2b
Name:Adenosine receptor A2b
Type:G Protein-Coupled Receptor (GPCR)
Mol. Mass.:36341.22
Organism:Homo sapiens (Human)
Description:n/a
Residue:332
BDBM50110988
NameBDBM50110988
Synonyms:CHEMBL37621 | [4-(2,6-Dioxo-1-propyl-2,3,6,7-tetrahydro-1H-purin-8-yl)-phenoxy]-acetic acid
TypeSmall organic molecule
Emp. Form.C16H16N4O5
Mol. Mass.344.322
SMILESCCCn1c(=O)[nH]c2nc([nH]c2c1=O)-c1ccc(OCC(O)=O)cc1