Reaction Details
TargetAdenosine receptor A2a
LigandBDBM50110979
Substrate/Competitorn/a
Meas. Tech.ChEMBL_30137 (CHEMBL641340)
Ki 709±n/a nM
Citation Hayallah, AMSandoval-Ramírez, JReith, USchobert, UPreiss, BSchumacher, BDaly, JWMüller, CE 1,8-disubstituted xanthine derivatives: synthesis of potent A2B-selective adenosine receptor antagonists. J Med Chem45:1500-10 (2002) Adenosine receptor A2a
Name:Adenosine receptor A2a
Type:G Protein-Coupled Receptor (GPCR)
Mol. Mass.:45015.65
Organism:Rattus norvegicus (rat)
Description:Rat A2A receptors expressed in CHO cells.
Residue:410
BDBM50110979
NameBDBM50110979
Synonyms:CHEMBL284288 | [4-(2,6-Dioxo-1-propyl-2,3,6,7-tetrahydro-1H-purin-8-yl)-phenoxy]-acetic acid methyl ester
TypeSmall organic molecule
Emp. Form.C17H18N4O5
Mol. Mass.358.3486
SMILESCCCn1c(=O)[nH]c2nc([nH]c2c1=O)-c1ccc(OCC(=O)OC)cc1