Reaction Details
TargetAdenosine receptor A1
LigandBDBM50110967
Substrate/Competitorn/a
Meas. Tech.ChEMBL_29625 (CHEMBL636643)
Ki 481.0±n/a nM
Citation Hayallah, AMSandoval-Ramírez, JReith, USchobert, UPreiss, BSchumacher, BDaly, JWMüller, CE 1,8-disubstituted xanthine derivatives: synthesis of potent A2B-selective adenosine receptor antagonists. J Med Chem45:1500-10 (2002) Adenosine receptor A1
Name:Adenosine receptor A1
Type:Protein
Mol. Mass.:36704.13
Organism:Rattus norvegicus (rat)
Description:n/a
Residue:326
BDBM50110967
NameBDBM50110967
Synonyms:4-(1-Butyl-2,6-dioxo-2,3,6,7-tetrahydro-1H-purin-8-yl)-benzoic acid | CHEMBL35094
TypeSmall organic molecule
Emp. Form.C16H16N4O4
Mol. Mass.328.3226
SMILESCCCCn1c(=O)[nH]c2nc([nH]c2c1=O)-c1ccc(cc1)C(O)=O