Reaction Details
TargetAdenosine receptor A1
LigandBDBM50110982
Substrate/Competitorn/a
Meas. Tech.ChEMBL_27903 (CHEMBL640563)
Ki 68±n/a nM
Citation Hayallah, AMSandoval-Ramírez, JReith, USchobert, UPreiss, BSchumacher, BDaly, JWMüller, CE 1,8-disubstituted xanthine derivatives: synthesis of potent A2B-selective adenosine receptor antagonists. J Med Chem45:1500-10 (2002) Adenosine receptor A1
Name:Adenosine receptor A1
Type:G Protein-Coupled Receptor (GPCR)
Mol. Mass.:36520.92
Organism:Homo sapiens (Human)
Description:P30542
Residue:326
BDBM50110982
NameBDBM50110982
Synonyms:2-[4-(2,6-Dioxo-1-propyl-2,3,6,7-tetrahydro-1H-purin-8-yl)-phenoxy]-N-(2-hydroxy-ethyl)-acetamide | CHEMBL416417
TypeSmall organic molecule
Emp. Form.C18H21N5O5
Mol. Mass.387.3898
SMILESCCCn1c(=O)[nH]c2nc([nH]c2c1=O)-c1ccc(OCC(=O)NCCO)cc1