Reaction Details
TargetAdenosine receptor A3
LigandBDBM50110977
Substrate/Competitorn/a
Meas. Tech.ChEMBL_29891 (CHEMBL641962)
Ki 102±n/a nM
Citation Hayallah, AMSandoval-Ramírez, JReith, USchobert, UPreiss, BSchumacher, BDaly, JWMüller, CE 1,8-disubstituted xanthine derivatives: synthesis of potent A2B-selective adenosine receptor antagonists. J Med Chem45:1500-10 (2002) Adenosine receptor A3
Name:Adenosine receptor A3
Type:G Protein-Coupled Receptor (GPCR)
Mol. Mass.:36197.32
Organism:Homo sapiens (Human)
Description:P0DMS8
Residue:318
BDBM50110977
NameBDBM50110977
Synonyms:1-Butyl-8-(4-{2-[4-(2-methoxy-phenyl)-piperazin-1-yl]-2-oxo-ethoxy}-phenyl)-3,7-dihydro-purine-2,6-dione | CHEMBL37726
TypeSmall organic molecule
Emp. Form.C28H32N6O5
Mol. Mass.532.5909
SMILESCCCCn1c(=O)[nH]c2nc([nH]c2c1=O)-c1ccc(OCC(=O)N2CCN(CC2)c2ccccc2OC)cc1