Reaction Details
TargetAdenosine receptor A1
LigandBDBM50110992
Substrate/Competitorn/a
Meas. Tech.ChEMBL_29625 (CHEMBL636643)
Ki 37±n/a nM
Citation Hayallah, AMSandoval-Ramírez, JReith, USchobert, UPreiss, BSchumacher, BDaly, JWMüller, CE 1,8-disubstituted xanthine derivatives: synthesis of potent A2B-selective adenosine receptor antagonists. J Med Chem45:1500-10 (2002) Adenosine receptor A1
Name:Adenosine receptor A1
Type:Protein
Mol. Mass.:36704.13
Organism:Rattus norvegicus (rat)
Description:n/a
Residue:326
BDBM50110992
NameBDBM50110992
Synonyms:8-{4-[2-(4-Benzyl-piperazin-1-yl)-2-oxo-ethoxy]-phenyl}-1-butyl-3,7-dihydro-purine-2,6-dione | CHEMBL38304
TypeSmall organic molecule
Emp. Form.C28H32N6O4
Mol. Mass.516.5915
SMILESCCCCn1c(=O)[nH]c2nc([nH]c2c1=O)-c1ccc(OCC(=O)N2CCN(Cc3ccccc3)CC2)cc1