Reaction Details
TargetAdenosine receptor A2b
LigandBDBM50110971
Substrate/Competitorn/a
Meas. Tech.ChEMBL_30604 (CHEMBL642011)
Ki 2.7±n/a nM
Citation Hayallah, AMSandoval-Ramírez, JReith, USchobert, UPreiss, BSchumacher, BDaly, JWMüller, CE 1,8-disubstituted xanthine derivatives: synthesis of potent A2B-selective adenosine receptor antagonists. J Med Chem45:1500-10 (2002) Adenosine receptor A2b
Name:Adenosine receptor A2b
Type:G Protein-Coupled Receptor (GPCR)
Mol. Mass.:36341.22
Organism:Homo sapiens (Human)
Description:n/a
Residue:332
BDBM50110971
NameBDBM50110971
Synonyms:8-(4-Bromo-phenyl)-1-butyl-3,7-dihydro-purine-2,6-dione | CHEMBL34762
TypeSmall organic molecule
Emp. Form.C15H15BrN4O2
Mol. Mass.363.209
SMILESCCCCn1c(=O)[nH]c2nc([nH]c2c1=O)-c1ccc(Br)cc1