Reaction Details
TargetAdenosine receptor A2b
LigandBDBM50110975
Substrate/Competitorn/a
Meas. Tech.ChEMBL_30604 (CHEMBL642011)
Ki 2.5±n/a nM
Citation Hayallah, AMSandoval-Ramírez, JReith, USchobert, UPreiss, BSchumacher, BDaly, JWMüller, CE 1,8-disubstituted xanthine derivatives: synthesis of potent A2B-selective adenosine receptor antagonists. J Med Chem45:1500-10 (2002) Adenosine receptor A2b
Name:Adenosine receptor A2b
Type:G Protein-Coupled Receptor (GPCR)
Mol. Mass.:36341.22
Organism:Homo sapiens (Human)
Description:n/a
Residue:332
BDBM50110975
NameBDBM50110975
Synonyms:8-(4-Iodo-phenyl)-1,3-dipropyl-3,7-dihydro-purine-2,6-dione | CHEMBL36963
TypeSmall organic molecule
Emp. Form.C17H19IN4O2
Mol. Mass.438.2628
SMILESCCCn1c2nc([nH]c2c(=O)n(CCC)c1=O)-c1ccc(I)cc1