Reaction Details
TargetAdenosine receptor A1
LigandBDBM50110989
Substrate/Competitorn/a
Meas. Tech.ChEMBL_29625 (CHEMBL636643)
Ki 17±n/a nM
Citation Hayallah, AMSandoval-Ramírez, JReith, USchobert, UPreiss, BSchumacher, BDaly, JWMüller, CE 1,8-disubstituted xanthine derivatives: synthesis of potent A2B-selective adenosine receptor antagonists. J Med Chem45:1500-10 (2002) Adenosine receptor A1
Name:Adenosine receptor A1
Type:Protein
Mol. Mass.:36704.13
Organism:Rattus norvegicus (rat)
Description:n/a
Residue:326
BDBM50110989
NameBDBM50110989
Synonyms:1-Butyl-8-{4-[2-oxo-2-(4-phenyl-piperazin-1-yl)-ethoxy]-phenyl}-3,7-dihydro-purine-2,6-dione | CHEMBL34543
TypeSmall organic molecule
Emp. Form.C27H30N6O4
Mol. Mass.502.5649
SMILESCCCCn1c(=O)[nH]c2nc([nH]c2c1=O)-c1ccc(OCC(=O)N2CCN(CC2)c2ccccc2)cc1