Reaction Details
TargetAdenosine receptor A1
LigandBDBM50042211
Substrate/Competitorn/a
Meas. Tech.ChEMBL_29625 (CHEMBL636643)
Ki 14±n/a nM
Citation Hayallah, AMSandoval-Ramírez, JReith, USchobert, UPreiss, BSchumacher, BDaly, JWMüller, CE 1,8-disubstituted xanthine derivatives: synthesis of potent A2B-selective adenosine receptor antagonists. J Med Chem45:1500-10 (2002) Adenosine receptor A1
Name:Adenosine receptor A1
Type:Protein
Mol. Mass.:36704.13
Organism:Rattus norvegicus (rat)
Description:n/a
Residue:326
BDBM50042211
NameBDBM50042211
Synonyms:8-Cyclopentyl-1-propyl-3,7-dihydro-purine-2,6-dione CHEMBL37243
TypeSmall organic molecule
Emp. Form.C13H18N4O2
Mol. Mass.262.3076
SMILESCCCn1c(=O)[nH]c2nc([nH]c2c1=O)C1CCCC1