Reaction Details
TargetAdenosine receptor A1
LigandBDBM50110976
Substrate/Competitorn/a
Meas. Tech.ChEMBL_29625 (CHEMBL636643)
Ki 68±n/a nM
Citation Hayallah, AMSandoval-Ramírez, JReith, USchobert, UPreiss, BSchumacher, BDaly, JWMüller, CE 1,8-disubstituted xanthine derivatives: synthesis of potent A2B-selective adenosine receptor antagonists. J Med Chem45:1500-10 (2002) Adenosine receptor A1
Name:Adenosine receptor A1
Type:Protein
Mol. Mass.:36704.13
Organism:Rattus norvegicus (rat)
Description:n/a
Residue:326
BDBM50110976
NameBDBM50110976
Synonyms:3-[4-(2,6-Dioxo-1-propyl-2,3,6,7-tetrahydro-1H-purin-8-yl)-phenyl]-acrylic acid | CHEMBL37987
TypeSmall organic molecule
Emp. Form.C17H16N4O4
Mol. Mass.340.3333
SMILESCCCn1c(=O)[nH]c2nc([nH]c2c1=O)-c1ccc(C=CC(O)=O)cc1