Reaction Details
TargetAdenosine receptor A2b
LigandBDBM50110969
Substrate/Competitorn/a
Meas. Tech.ChEMBL_30604 (CHEMBL642011)
Ki 3.8±n/a nM
Citation Hayallah, AMSandoval-Ramírez, JReith, USchobert, UPreiss, BSchumacher, BDaly, JWMüller, CE 1,8-disubstituted xanthine derivatives: synthesis of potent A2B-selective adenosine receptor antagonists. J Med Chem45:1500-10 (2002) Adenosine receptor A2b
Name:Adenosine receptor A2b
Type:G Protein-Coupled Receptor (GPCR)
Mol. Mass.:36341.22
Organism:Homo sapiens (Human)
Description:n/a
Residue:332
BDBM50110969
NameBDBM50110969
Synonyms:8-(4-Bromo-phenyl)-1,3-dipropyl-3,7-dihydro-purine-2,6-dione | CHEMBL40055
TypeSmall organic molecule
Emp. Form.C17H19BrN4O2
Mol. Mass.391.262
SMILESCCCn1c2nc([nH]c2c(=O)n(CCC)c1=O)-c1ccc(Br)cc1