Reaction Details
TargetPeroxisome proliferator-activated receptor gamma/Retinoic acid receptor RXR-alpha
LigandBDBM50111006
Substrate/Competitorn/a
Meas. Tech.ChEMBL_43804 (CHEMBL656374)
EC50 8.870±n/a nM
Citation Momose, YMaekawa, TYamano, TKawada, MOdaka, HIkeda, HSohda, T Novel 5-substituted 2,4-thiazolidinedione and 2,4-oxazolidinedione derivatives as insulin sensitizers with antidiabetic activities. J Med Chem45:1518-34 (2002) Peroxisome proliferator-activated receptor gamma/Retinoic acid receptor RXR-alpha
Name:Peroxisome proliferator-activated receptor gamma/Retinoic acid receptor RXR-alpha
Type:n/a
Mol. Mass.:n/a
Description:ASSAY_ID of EBI is 43803
Components:This complex has 3 components.
Component 1
Name:Peroxisome proliferator-activated receptor gamma
Synonyms:NR1C3 PPAR-gamma PPARG_HUMAN Peroxisome proliferator-activated receptor gamma (PPAR gamma) Peroxisome proliferator-activated receptor gamma (PPARĪ³) peroxisome proliferator-activated receptor gamma isoform 2
Type:Nuclear Receptor
Mol. Mass.:57613.46
Organism:Homo sapiens (Human)
Description:P37231
Residue:505
Component 2
Name:Retinoic acid receptor RXR-alpha
Synonyms:NR2B1 Nuclear receptor subfamily 4 group A member 2 RXRA Retinoic acid receptor RXR-alpha/gamma Retinoid receptor
Type:PROTEIN
Mol. Mass.:50820.38
Organism:Homo sapiens (Human)
Description:ChEMBL_1456363
Residue:462
BDBM50111006
NameBDBM50111006
Synonyms:5-{3-[4-(2-Furan-2-yl-5-methyl-oxazol-4-ylmethoxy)-3-methoxy-phenyl]-propyl}-oxazolidine-2,4-dione | CHEMBL289272
TypeSmall organic molecule
Emp. Form.C22H22N2O7
Mol. Mass.426.4193
SMILESCOc1cc(CCCc2oc(=O)[nH]c2O)ccc1OCc1nc(oc1C)-c1ccco1