Reaction Details
TargetGenome polyprotein
LigandBDBM50111056
Substrate/Competitorn/a
Meas. Tech.ChEBML_143619
Ki>100000±n/a nM
Citation Zhang, RDurkin, JPWindsor, WT Azapeptides as inhibitors of the hepatitis C virus NS3 serine protease. Bioorg Med Chem Lett12:1005-8 (2002) Genome polyprotein
Name:Genome polyprotein
Type:Protein
Mol. Mass.:67067.41
Organism:Hepatitis C virus
Description:A3EZI9
Residue:631
BDBM50111056
NameBDBM50111056
Synonyms:Azapeptide | CHEMBL384261
TypeSmall organic molecule
Emp. Form.C44H64N10O18
Mol. Mass.1021.0352
SMILESCCCN(NC(=O)[C@H]1CCCN1C(=O)[C@@H](NC(=O)[C@@H](NC(=O)[C@H](CC(O)=O)NC(=O)[C@H](CCC(O)=O)NC(=O)[C@@H](NC(=O)[C@H](CC(O)=O)NC(C)=O)[C@@H](C)O)C(C)C)C(C)C)C(=O)c1ccc(cc1)[N+]([O-])=O