Reaction Details
TargetGenome polyprotein
LigandBDBM50111074
Substrate/Competitorn/a
Meas. Tech.ChEBML_143619
Ki 8000±n/a nM
Citation Zhang, RDurkin, JPWindsor, WT Azapeptides as inhibitors of the hepatitis C virus NS3 serine protease. Bioorg Med Chem Lett12:1005-8 (2002) Genome polyprotein
Name:Genome polyprotein
Type:Protein
Mol. Mass.:67067.41
Organism:Hepatitis C virus
Description:A3EZI9
Residue:631
BDBM50111074
NameBDBM50111074
Synonyms:Azapeptide | CHEMBL262528
TypeSmall organic molecule
Emp. Form.C44H65N9O17
Mol. Mass.992.037
SMILESCCCN(NC(=O)[C@H]1CCCN1C(=O)[C@@H](NC(=O)[C@@H](NC(=O)[C@H](CC(O)=O)NC(=O)[C@H](CCC(O)=O)NC(=O)[C@@H](NC(=O)[C@H](CC(O)=O)NC(C)=O)[C@@H](C)O)C(C)C)C(C)C)C(=O)Oc1ccccc1