Reaction Details
TargetGenome polyprotein
LigandBDBM50111067
Substrate/Competitorn/a
Meas. Tech.ChEBML_143619
Ki 20000±n/a nM
Citation Zhang, RDurkin, JPWindsor, WT Azapeptides as inhibitors of the hepatitis C virus NS3 serine protease. Bioorg Med Chem Lett12:1005-8 (2002) Genome polyprotein
Name:Genome polyprotein
Type:Protein
Mol. Mass.:67067.41
Organism:Hepatitis C virus
Description:A3EZI9
Residue:631
BDBM50111067
NameBDBM50111067
Synonyms:Asp-Thr-Glu-Asp-Val-Val-Pro-(AzaNva)-Ser-Met-Ser-Tyr-Thr-Trp-Thr-Gly-Lys-OH | CHEMBL414772
TypeSmall organic molecule
Emp. Form.C83H126N20O30S
Mol. Mass.1916.07
SMILESCCCN(NC(=O)[C@H]1CCCN1C(=O)[C@@H](NC(=O)[C@@H](NC(=O)[C@H](CC(O)=O)NC(=O)[C@H](CCC(O)=O)NC(=O)[C@@H](NC(=O)[C@@H](N)CC(O)=O)[C@@H](C)O)C(C)C)C(C)C)C(=O)N[C@@H](CO)C(=O)N[C@@H](CCSC)C(=O)N[C@@H](CO)C(=O)N[C@@H](Cc1ccc(O)cc1)C(=O)N[C@@H]([C@@H](C)O)C(=O)N[C@@H](Cc1c[nH]c2ccccc12)C(=O)N[C@@H]([C@@H](C)O)C(=O)NCC(=O)N[C@@H](CCCCN)C(O)=O