Reaction Details
TargetMuscarinic acetylcholine receptor M1
LigandBDBM50111628
Substrate/Competitorn/a
Meas. Tech.ChEMBL_139066 (CHEMBL745661)
Ki 500±n/a nM
Citation Mouithys-Mickalad, APoupaert, JHSpampinato, SLesieur, D Synthesis and pharmacological evaluation of 6-piperidino- and 6-piperazinoalkyl-2(3H)-benzothiazolones as mixed sigma/5-HT(1A) ligands. Bioorg Med Chem Lett12:1149-52 (2002) Muscarinic acetylcholine receptor M1
Name:Muscarinic acetylcholine receptor M1
Type:Enzyme Catalytic Domain
Mol. Mass.:51390.46
Organism:RAT
Description:P08482
Residue:460
BDBM50111628
NameBDBM50111628
Synonyms:6-{4-[4-(3,4-Dichloro-benzyl)-piperazin-1-yl]-butyl}-3-methyl-3H-benzothiazol-2-one | CHEMBL15456
TypeSmall organic molecule
Emp. Form.C23H27Cl2N3OS
Mol. Mass.464.451
SMILESCn1c2ccc(CCCCN3CCN(Cc4ccc(Cl)c(Cl)c4)CC3)cc2sc1=O