Reaction Details
Target5-hydroxytryptamine receptor 2A
LigandBDBM50111625
Substrate/Competitorn/a
Meas. Tech.ChEBML_2654
Ki 900±n/a nM
Citation Mouithys-Mickalad, APoupaert, JHSpampinato, SLesieur, D Synthesis and pharmacological evaluation of 6-piperidino- and 6-piperazinoalkyl-2(3H)-benzothiazolones as mixed sigma/5-HT(1A) ligands. Bioorg Med Chem Lett12:1149-52 (2002) 5-hydroxytryptamine receptor 2A
Name:5-hydroxytryptamine receptor 2A
Type:G Protein-Coupled Receptor (GPCR)
Mol. Mass.:52852.05
Organism:Rattus norvegicus (rat)
Description:Rat cortex membranes 5-HT2A receptors.
Residue:471
BDBM50111625
NameBDBM50111625
Synonyms:6-[4-(4-Benzyl-piperazin-1-yl)-butyl]-3-methyl-3H-benzothiazol-2-one | CHEMBL15941
TypeSmall organic molecule
Emp. Form.C23H29N3OS
Mol. Mass.395.561
SMILESCn1c2ccc(CCCCN3CCN(Cc4ccccc4)CC3)cc2sc1=O