Reaction Details
TargetBone morphogenetic protein 1
LigandBDBM50111805
Substrate/Competitorn/a
Meas. Tech.ChEBML_158892
IC50 28±n/a nM
Citation Dankwardt, SMAbbot, SCBroka, CAMartin, RLChan, CSSpringman, EBVan Wart, HEWalker, KA Amino acid derived sulfonamide hydroxamates as inhibitors of procollagen C-proteinase. Part 2: Solid-phase optimization of side chains. Bioorg Med Chem Lett12:1233-5 (2002) Bone morphogenetic protein 1
Name:Bone morphogenetic protein 1
Type:PROTEIN
Mol. Mass.:111254.03
Organism:Homo sapiens (Human)
Description:ChEMBL_518962
Residue:986
BDBM50111805
NameBDBM50111805
Synonyms:(R)-2-[Benzo[1,3]dioxol-5-ylmethyl-(4-methoxy-benzenesulfonyl)-amino]-5-(N',N'-diethyl-guanidino)-pentanoic acid | CHEMBL277910
TypeSmall organic molecule
Emp. Form.C25H34N4O7S
Mol. Mass.534.625
SMILESCCN(CC)C(=N)NCCC[C@@H](N(Cc1ccc2OCOc2c1)S(=O)(=O)c1ccc(OC)cc1)C(O)=O