Reaction Details
TargetBone morphogenetic protein 1
LigandBDBM50111842
Substrate/Competitorn/a
Meas. Tech.ChEBML_158892
IC50 10±n/a nM
Citation Dankwardt, SMAbbot, SCBroka, CAMartin, RLChan, CSSpringman, EBVan Wart, HEWalker, KA Amino acid derived sulfonamide hydroxamates as inhibitors of procollagen C-proteinase. Part 2: Solid-phase optimization of side chains. Bioorg Med Chem Lett12:1233-5 (2002) Bone morphogenetic protein 1
Name:Bone morphogenetic protein 1
Type:PROTEIN
Mol. Mass.:111254.03
Organism:Homo sapiens (Human)
Description:ChEMBL_518962
Residue:986
BDBM50111842
NameBDBM50111842
Synonyms:(R)-2-[Benzo[1,3]dioxol-5-ylmethyl-(4-methoxy-benzenesulfonyl)-amino]-pent-4-ynoic acid | CHEMBL279655
TypeSmall organic molecule
Emp. Form.C20H19NO7S
Mol. Mass.417.432
SMILESCOc1ccc(cc1)S(=O)(=O)N(Cc1ccc2OCOc2c1)[C@H](CC#C)C(O)=O