Reaction Details
TargetBone morphogenetic protein 1
LigandBDBM50102969
Substrate/Competitorn/a
Meas. Tech.ChEMBL_158889 (CHEMBL760877)
IC50 24±n/a nM
Citation Dankwardt, SMAbbot, SCBroka, CAMartin, RLChan, CSSpringman, EBVan Wart, HEWalker, KA Amino acid derived sulfonamide hydroxamates as inhibitors of procollagen C-proteinase. Part 2: Solid-phase optimization of side chains. Bioorg Med Chem Lett12:1233-5 (2002) Bone morphogenetic protein 1
Name:Bone morphogenetic protein 1
Type:PROTEIN
Mol. Mass.:111254.03
Organism:Homo sapiens (Human)
Description:ChEMBL_518962
Residue:986
BDBM50102969
NameBDBM50102969
Synonyms:CHEMBL21073 | {(R)-4-[Benzo[1,3]dioxol-5-ylmethyl-(4-methoxy-benzenesulfonyl)-amino]-4-hydroxycarbamoyl-butyl}-carbamic acid 2-bromo-benzyl ester
TypeSmall organic molecule
Emp. Form.C28H30BrN3O9S
Mol. Mass.664.522
SMILESCOc1ccc(cc1)S(=O)(=O)N(Cc1ccc2OCOc2c1)[C@H](CCCNC(=O)OCc1ccccc1Br)C(=O)NO