Reaction Details
TargetBone morphogenetic protein 1
LigandBDBM50111867
Substrate/Competitorn/a
Meas. Tech.ChEMBL_158889 (CHEMBL760877)
IC50 27±n/a nM
Citation Dankwardt, SMAbbot, SCBroka, CAMartin, RLChan, CSSpringman, EBVan Wart, HEWalker, KA Amino acid derived sulfonamide hydroxamates as inhibitors of procollagen C-proteinase. Part 2: Solid-phase optimization of side chains. Bioorg Med Chem Lett12:1233-5 (2002) Bone morphogenetic protein 1
Name:Bone morphogenetic protein 1
Type:PROTEIN
Mol. Mass.:111254.03
Organism:Homo sapiens (Human)
Description:ChEMBL_518962
Residue:986
BDBM50111867
NameBDBM50111867
Synonyms:(R)-2-[Benzo[1,3]dioxol-5-ylmethyl-(4-methoxy-benzenesulfonyl)-amino]-3-(3-benzyl-3H-imidazol-4-yl)-N-hydroxy-propionamide | CHEMBL277469
TypeSmall organic molecule
Emp. Form.C28H28N4O7S
Mol. Mass.564.61
SMILESCOc1ccc(cc1)S(=O)(=O)N(Cc1ccc2OCOc2c1)[C@H](Cc1cncn1Cc1ccccc1)C(=O)NO