Reaction Details
TargetcGMP-specific 3',5'-cyclic phosphodiesterase
LigandBDBM50111900
Substrate/Competitorn/a
Meas. Tech.ChEBML_155211
IC50 0.700000±n/a nM
Citation Haning, HNiewöhner, USchenke, TEs-Sayed, MSchmidt, GLampe, TBischoff, E Imidazo[5,1-f]triazin-4(3H)-ones, a new class of potent PDE 5 inhibitors. Bioorg Med Chem Lett12:865-8 (2002) cGMP-specific 3',5'-cyclic phosphodiesterase
Name:cGMP-specific 3',5'-cyclic phosphodiesterase
Type:Protein
Mol. Mass.:99975.83
Organism:Homo sapiens (Human)
Description:O76074
Residue:875
BDBM50111900
NameBDBM50111900
Synonyms:4-[4-Ethoxy-3-(5-methyl-4-oxo-7-propyl-3,4-dihydro-imidazo[5,1-f][1,2,4]triazin-2-yl)-benzenesulfonyl]-1-ethyl-piperazin-1-ium; chloride Levitra | VARDENAFIL HYDROCHLORIDE
TypeSmall organic molecule
Emp. Form.C23H33N6O4S
Mol. Mass.489.61
SMILESCCCc1nc(C)c2n1nc([nH]c2=O)-c1cc(ccc1OCC)S(=O)(=O)N1CC[NH+](CC)CC1