Reaction Details
TargetDual specificity calcium/calmodulin-dependent 3',5'-cyclic nucleotide phosphodiesterase 1A/1B
LigandBDBM50111900
Substrate/Competitorn/a
Meas. Tech.ChEMBL_155998 (CHEMBL764743)
IC50 180±n/a nM
Citation Haning, HNiewöhner, USchenke, TEs-Sayed, MSchmidt, GLampe, TBischoff, E Imidazo[5,1-f]triazin-4(3H)-ones, a new class of potent PDE 5 inhibitors. Bioorg Med Chem Lett12:865-8 (2002) Dual specificity calcium/calmodulin-dependent 3',5'-cyclic nucleotide phosphodiesterase 1A/1B
Name:Dual specificity calcium/calmodulin-dependent 3',5'-cyclic nucleotide phosphodiesterase 1A/1B
Synonyms:Phosphodiesterase 1
Type:n/a
Mol. Mass.:n/a
Description:ASSAY_ID of ChEMBL is 156011
Components:This complex has 2 components.
Component 1
Name:Dual specificity calcium/calmodulin-dependent 3',5'-cyclic nucleotide phosphodiesterase 1B
Type:PROTEIN
Mol. Mass.:60991.90
Organism:Bos taurus
Description:ChEMBL_104913
Residue:534
Component 2
Name:Dual specificity calcium/calmodulin-dependent 3',5'-cyclic nucleotide phosphodiesterase 1A
Synonyms:Calcium/calmodulin-dependent 3',5'-cyclic nucleotide phosphodiesterase 1A PDE1A Phosphodiesterase 1 | Phosphodiesterase 1A
Type:Enzyme Catalytic Domain
Mol. Mass.:60835.05
Organism:BOVINE
Description:Phosphodiesterase 1 0 BOVINE::P14100
Residue:530
BDBM50111900
NameBDBM50111900
Synonyms:4-[4-Ethoxy-3-(5-methyl-4-oxo-7-propyl-3,4-dihydro-imidazo[5,1-f][1,2,4]triazin-2-yl)-benzenesulfonyl]-1-ethyl-piperazin-1-ium; chloride Levitra | VARDENAFIL HYDROCHLORIDE
TypeSmall organic molecule
Emp. Form.C23H33N6O4S
Mol. Mass.489.61
SMILESCCCc1nc(C)c2n1nc([nH]c2=O)-c1cc(ccc1OCC)S(=O)(=O)N1CC[NH+](CC)CC1