Reaction Details
TargetSerine protease 1/Trypsin-2
LigandBDBM50112086
Substrate/Competitorn/a
Meas. Tech.ChEMBL_225793 (CHEMBL845143)
Ki 50.3±n/a nM
Citation Hauel, NHNar, HPriepke, HRies, UStassen, JMWienen, W Structure-based design of novel potent nonpeptide thrombin inhibitors. J Med Chem45:1757-66 (2002) Serine protease 1/Trypsin-2
Name:Serine protease 1/Trypsin-2
Synonyms:Trypsin II
Type:n/a
Mol. Mass.:n/a
Description:ASSAY_ID of EBI is 212335
Components:This complex has 2 components.
Component 1
Name:Serine protease 1
Type:Enzyme
Mol. Mass.:26557.80
Organism:Homo sapiens (Human)
Description:P07477
Residue:247
Component 2
Name:Trypsin-2
Synonyms:Anionic trypsinogen Serine protease 2 TRY2_HUMAN Thrombin & trypsin Trypsin II | Trypsin-2
Type:PROTEIN
Mol. Mass.:26479.43
Organism:Homo sapiens (Human)
Description:ChEMBL_41517
Residue:247
BDBM50112086
NameBDBM50112086
Synonyms:3-({2-[(4-Carbamimidoyl-phenylamino)-methyl]-1-methyl-1H-benzoimidazole-5-carbonyl}-pyridin-2-yl-amino)-propionic acid DABIGATRAN
TypeSmall organic molecule
Emp. Form.C25H25N7O3
Mol. Mass.471.5111
SMILESCn1c(CNc2ccc(cc2)C(N)=N)nc2cc(ccc12)C(=O)N(CCC(O)=O)c1ccccn1