Reaction Details
TargetHistone deacetylase 1
LigandBDBM50100455
Substrate/Competitorn/a
Meas. Tech.ChEMBL_87865 (CHEMBL697288)
IC50 4200±n/a nM
Citation Mai, AMassa, SRagno, REsposito, MSbardella, GNocca, GScatena, RJesacher, FLoidl, PBrosch, G Binding mode analysis of 3-(4-benzoyl-1-methyl-1H-2-pyrrolyl)-N-hydroxy-2-propenamide: a new synthetic histone deacetylase inhibitor inducing histone hyperacetylation, growth inhibition, and terminal cell differentiation. J Med Chem45:1778-84 (2002) Histone deacetylase 1
Name:Histone deacetylase 1
Type:Protein
Mol. Mass.:55062.26
Organism:Mus musculus (Mouse)
Description:O09106
Residue:482
BDBM50100455
NameBDBM50100455
Synonyms:3-[(E)-4-(4-Dimethylamino-benzoyl)-1-methyl-1H-pyrrol-2-yl]-N-hydroxy-acrylamide CHEMBL51060
TypeSmall organic molecule
Emp. Form.C17H19N3O3
Mol. Mass.313.3511
SMILESCN(C)c1ccc(cc1)C(=O)c1cc(\C=C\C(=O)NO)n(C)c1