Reaction Details
TargetHistone deacetylase 1
LigandBDBM50100452
Substrate/Competitorn/a
Meas. Tech.ChEMBL_87865 (CHEMBL697288)
IC50 4900±n/a nM
Citation Mai, AMassa, SRagno, REsposito, MSbardella, GNocca, GScatena, RJesacher, FLoidl, PBrosch, G Binding mode analysis of 3-(4-benzoyl-1-methyl-1H-2-pyrrolyl)-N-hydroxy-2-propenamide: a new synthetic histone deacetylase inhibitor inducing histone hyperacetylation, growth inhibition, and terminal cell differentiation. J Med Chem45:1778-84 (2002) Histone deacetylase 1
Name:Histone deacetylase 1
Type:Protein
Mol. Mass.:55062.26
Organism:Mus musculus (Mouse)
Description:O09106
Residue:482
BDBM50100452
NameBDBM50100452
Synonyms:3-((E)-4-Benzoyl-1-methyl-1H-pyrrol-2-yl)-N-hydroxy-acrylamide CHEMBL13168
TypeSmall organic molecule
Emp. Form.C15H14N2O3
Mol. Mass.270.2833
SMILESCn1cc(cc1\C=C\C(=O)NO)C(=O)c1ccccc1