Reaction Details
TargetHistone deacetylase 2b
LigandBDBM50100456
Substrate/Competitorn/a
Meas. Tech.ChEMBL_87880 (CHEMBL698799)
IC50 1900±n/a nM
Citation Mai, AMassa, SRagno, REsposito, MSbardella, GNocca, GScatena, RJesacher, FLoidl, PBrosch, G Binding mode analysis of 3-(4-benzoyl-1-methyl-1H-2-pyrrolyl)-N-hydroxy-2-propenamide: a new synthetic histone deacetylase inhibitor inducing histone hyperacetylation, growth inhibition, and terminal cell differentiation. J Med Chem45:1778-84 (2002) Histone deacetylase 2b
Name:Histone deacetylase 2b
Synonyms:Histone deacetylase HD2
Type:PROTEIN
Mol. Mass.:30785.07
Organism:Zea mays
Description:ChEMBL_87549
Residue:286
BDBM50100456
NameBDBM50100456
TypeSmall organic molecule
Emp. Form.C16H16N2O3
Mol. Mass.284.3098
SMILESCc1ccc(cc1)C(=O)c1cc(\C=C\C(=O)NO)n(C)c1