Reaction Details
TargetAdenosine receptor A1
LigandBDBM50112184
Substrate/Competitorn/a
Meas. Tech.ChEMBL_29012 (CHEMBL643486)
Ki 210±n/a nM
Citation Van Calenbergh, SLink, AFujikawa, Sde Ligt, RAVanheusden, VGolisade, ABlaton, NMRozenski, JIJzerman, APHerdewijn, P 5'-Deoxy congeners of 9-(3-amido-3-deoxy-beta-D-xylofuranosyl)-N(6)-cyclopentyladenine: new adenosine A(1) receptor antagonists and inverse agonists. J Med Chem45:1845-52 (2002) Adenosine receptor A1
Name:Adenosine receptor A1
Type:Protein
Mol. Mass.:36704.13
Organism:Rattus norvegicus (rat)
Description:n/a
Residue:326
BDBM50112184
NameBDBM50112184
Synonyms:1-Phenyl-cyclohexanecarboxylic acid [5-(6-cyclopentylamino-purin-9-yl)-4-hydroxy-2-methyl-tetrahydro-furan-3-yl]-amide | CHEMBL299238
TypeSmall organic molecule
Emp. Form.C28H36N6O3
Mol. Mass.504.6238
SMILESC[C@H]1O[C@H]([C@H](O)[C@H]1NC(=O)C1(CCCCC1)c1ccccc1)n1cnc2c(NC3CCCC3)ncnc12