Reaction Details
TargetAdenosine receptor A1
LigandBDBM50112187
Substrate/Competitorn/a
Meas. Tech.ChEMBL_27576 (CHEMBL643498)
Ki 419.0±n/a nM
Citation Van Calenbergh, SLink, AFujikawa, Sde Ligt, RAVanheusden, VGolisade, ABlaton, NMRozenski, JIJzerman, APHerdewijn, P 5'-Deoxy congeners of 9-(3-amido-3-deoxy-beta-D-xylofuranosyl)-N(6)-cyclopentyladenine: new adenosine A(1) receptor antagonists and inverse agonists. J Med Chem45:1845-52 (2002) Adenosine receptor A1
Name:Adenosine receptor A1
Type:G Protein-Coupled Receptor (GPCR)
Mol. Mass.:36520.92
Organism:Homo sapiens (Human)
Description:P30542
Residue:326
BDBM50112187
NameBDBM50112187
Synonyms:CHEMBL296399 | N-[5-(6-Cyclopentylamino-purin-9-yl)-4-hydroxy-2-methyl-tetrahydro-furan-3-yl]-4-thiophen-2-yl-butyramide
TypeSmall organic molecule
Emp. Form.C23H30N6O3S
Mol. Mass.470.588
SMILESC[C@H]1O[C@H]([C@H](O)[C@H]1NC(=O)CCCc1cccs1)n1cnc2c(NC3CCCC3)ncnc12