Reaction Details
TargetAdenosine receptor A1
LigandBDBM50112191
Substrate/Competitorn/a
Meas. Tech.ChEMBL_27576 (CHEMBL643498)
Ki 971±n/a nM
Citation Van Calenbergh, SLink, AFujikawa, Sde Ligt, RAVanheusden, VGolisade, ABlaton, NMRozenski, JIJzerman, APHerdewijn, P 5'-Deoxy congeners of 9-(3-amido-3-deoxy-beta-D-xylofuranosyl)-N(6)-cyclopentyladenine: new adenosine A(1) receptor antagonists and inverse agonists. J Med Chem45:1845-52 (2002) Adenosine receptor A1
Name:Adenosine receptor A1
Type:G Protein-Coupled Receptor (GPCR)
Mol. Mass.:36520.92
Organism:Homo sapiens (Human)
Description:P30542
Residue:326
BDBM50112191
NameBDBM50112191
Synonyms:2-(Thiophene-2-carbonyl)-cyclohexanecarboxylic acid [5-(6-cyclopentylamino-purin-9-yl)-4-hydroxy-2-methyl-tetrahydro-furan-3-yl]-amide | CHEMBL53795
TypeSmall organic molecule
Emp. Form.C27H34N6O4S
Mol. Mass.538.662
SMILESC[C@H]1O[C@H]([C@H](O)[C@H]1NC(=O)C1CCCC[C@H]1C(=O)c1cccs1)n1cnc2c(NC3CCCC3)ncnc12