Reaction Details
TargetAdenosine receptor A1
LigandBDBM50112188
Substrate/Competitorn/a
Meas. Tech.ChEMBL_29012 (CHEMBL643486)
Ki 54±n/a nM
Citation Van Calenbergh, SLink, AFujikawa, Sde Ligt, RAVanheusden, VGolisade, ABlaton, NMRozenski, JIJzerman, APHerdewijn, P 5'-Deoxy congeners of 9-(3-amido-3-deoxy-beta-D-xylofuranosyl)-N(6)-cyclopentyladenine: new adenosine A(1) receptor antagonists and inverse agonists. J Med Chem45:1845-52 (2002) Adenosine receptor A1
Name:Adenosine receptor A1
Type:Protein
Mol. Mass.:36704.13
Organism:Rattus norvegicus (rat)
Description:n/a
Residue:326
BDBM50112188
NameBDBM50112188
Synonyms:3-Chloro-N-[5-(6-cyclopentylamino-purin-9-yl)-4-hydroxy-2-hydroxymethyl-tetrahydro-furan-3-yl]-4-fluoro-benzamide | CHEMBL293371
TypeSmall organic molecule
Emp. Form.C22H24ClFN6O4
Mol. Mass.490.915
SMILESOC[C@H]1O[C@H]([C@H](O)[C@H]1NC(=O)c1ccc(F)c(Cl)c1)n1cnc2c(NC3CCCC3)ncnc12