Reaction Details
TargetAdenosine receptor A1
LigandBDBM50112198
Substrate/Competitorn/a
Meas. Tech.ChEMBL_27576 (CHEMBL643498)
Ki 773.0±n/a nM
Citation Van Calenbergh, SLink, AFujikawa, Sde Ligt, RAVanheusden, VGolisade, ABlaton, NMRozenski, JIJzerman, APHerdewijn, P 5'-Deoxy congeners of 9-(3-amido-3-deoxy-beta-D-xylofuranosyl)-N(6)-cyclopentyladenine: new adenosine A(1) receptor antagonists and inverse agonists. J Med Chem45:1845-52 (2002) Adenosine receptor A1
Name:Adenosine receptor A1
Type:G Protein-Coupled Receptor (GPCR)
Mol. Mass.:36520.92
Organism:Homo sapiens (Human)
Description:P30542
Residue:326
BDBM50112198
NameBDBM50112198
Synonyms:CHEMBL55099 | N-[5-(6-Cyclopentylamino-purin-9-yl)-4-hydroxy-2-hydroxymethyl-tetrahydro-furan-3-yl]-3-fluoro-4-methyl-benzamide
TypeSmall organic molecule
Emp. Form.C23H27FN6O4
Mol. Mass.470.4967
SMILESCc1ccc(cc1F)C(=O)N[C@H]1[C@@H](CO)O[C@H]([C@@H]1O)n1cnc2c(NC3CCCC3)ncnc12