Reaction Details
TargetRibosyldihydronicotinamide dehydrogenase [quinone]
LigandBDBM50112207
Substrate/Competitorn/a
Meas. Tech.ChEMBL_104942 (CHEMBL713109)
Ki 1000±n/a nM
Citation Leclerc, VYous, SDelagrange, PBoutin, JARenard, PLesieur, D Synthesis of nitroindole derivatives with high affinity and selectivity for melatoninergic binding sites MT(3). J Med Chem45:1853-9 (2002) Ribosyldihydronicotinamide dehydrogenase [quinone]
Name:Ribosyldihydronicotinamide dehydrogenase [quinone]
Type:Protein
Mol. Mass.:25917.25
Organism:Homo sapiens (Human)
Description:P16083
Residue:231
BDBM50112207
NameBDBM50112207
Synonyms:CHEMBL300729 | N-[2-(5-Methoxy-7-nitro-1H-indol-3-yl)-ethyl]-acetamide
TypeSmall organic molecule
Emp. Form.C13H15N3O4
Mol. Mass.277.2759
SMILESCOc1cc([N+]([O-])=O)c2[nH]cc(CCNC(C)=O)c2c1