Reaction Details
TargetMelatonin receptor type 1B
LigandBDBM50112201
Substrate/Competitorn/a
Meas. Tech.ChEMBL_105404 (CHEMBL710823)
Ki 194±n/a nM
Citation Leclerc, VYous, SDelagrange, PBoutin, JARenard, PLesieur, D Synthesis of nitroindole derivatives with high affinity and selectivity for melatoninergic binding sites MT(3). J Med Chem45:1853-9 (2002) Melatonin receptor type 1B
Name:Melatonin receptor type 1B
Type:Enzyme
Mol. Mass.:40203.54
Organism:Homo sapiens (Human)
Description:P49286
Residue:362
BDBM50112201
NameBDBM50112201
Synonyms:CHEMBL53622 N-[2-(5-Methoxy-1-methyl-4-nitro-1H-indol-3-yl)-ethyl]-acetamide
TypeSmall organic molecule
Emp. Form.C14H17N3O4
Mol. Mass.291.3025
SMILESCOc1ccc2n(C)cc(CCNC(C)=O)c2c1[N+]([O-])=O