Reaction Details
TargetMelatonin receptor type 1A
LigandBDBM50112202
Substrate/Competitorn/a
Meas. Tech.ChEMBL_104950 (CHEMBL713259)
Ki 1.1±n/a nM
Citation Leclerc, VYous, SDelagrange, PBoutin, JARenard, PLesieur, D Synthesis of nitroindole derivatives with high affinity and selectivity for melatoninergic binding sites MT(3). J Med Chem45:1853-9 (2002) Melatonin receptor type 1A
Name:Melatonin receptor type 1A
Type:Enzyme
Mol. Mass.:39392.94
Organism:Homo sapiens (Human)
Description:P48039
Residue:350
BDBM50112202
NameBDBM50112202
Synonyms:CHEMBL55084 | N-[2-(2-Iodo-5-methoxy-1-methyl-6-nitro-1H-indol-3-yl)-ethyl]-acetamide
TypeSmall organic molecule
Emp. Form.C14H16IN3O4
Mol. Mass.417.199
SMILESCOc1cc2c(CCNC(C)=O)c(I)n(C)c2cc1[N+]([O-])=O