Reaction Details
TargetMelatonin receptor type 1B
LigandBDBM50112208
Substrate/Competitorn/a
Meas. Tech.ChEMBL_105404 (CHEMBL710823)
Ki 39±n/a nM
Citation Leclerc, VYous, SDelagrange, PBoutin, JARenard, PLesieur, D Synthesis of nitroindole derivatives with high affinity and selectivity for melatoninergic binding sites MT(3). J Med Chem45:1853-9 (2002) Melatonin receptor type 1B
Name:Melatonin receptor type 1B
Type:Enzyme
Mol. Mass.:40203.54
Organism:Homo sapiens (Human)
Description:P49286
Residue:362
BDBM50112208
NameBDBM50112208
Synonyms:CHEMBL300728 N-[2-(2-Iodo-5-methoxy-1-methyl-4-nitro-1H-indol-3-yl)-ethyl]-acetamide
TypeSmall organic molecule
Emp. Form.C14H16IN3O4
Mol. Mass.417.199
SMILESCOc1ccc2n(C)c(I)c(CCNC(C)=O)c2c1[N+]([O-])=O