Reaction Details
TargetCoagulation factor X
LigandBDBM50112497
Substrate/Competitorn/a
Meas. Tech.ChEBML_49302
Ki 0.100000±n/a nM
Citation Wu, SGuilford, WJChou, YLGriedel, BDLiang, ASakata, SShaw, KJTrinh, LXu, WZhao, ZMorrissey, MM Design and synthesis of aminophenol-based factor Xa inhibitors. Bioorg Med Chem Lett12:1307-10 (2002) Coagulation factor X
Name:Coagulation factor X
Type:Enzyme
Mol. Mass.:54726.60
Organism:Homo sapiens (Human)
Description:n/a
Residue:488
BDBM50112497
NameBDBM50112497
Synonyms:CHEMBL26240 | N-[3-(5-Carbamimidoyl-2-hydroxy-phenyl)-allyl]-N-{4-[1-(1-imino-ethyl)-piperidin-4-yloxy]-3-trifluoromethyl-phenyl}-succinamic acid
TypeSmall organic molecule
Emp. Form.C28H32F3N5O5
Mol. Mass.575.5794
SMILESCC(=N)N1CCC(CC1)Oc1ccc(cc1C(F)(F)F)N(CC=Cc1cc(ccc1O)C(N)=N)C(=O)CCC(O)=O