Reaction Details
TargetProstaglandin G/H synthase 2
LigandBDBM50112547
Substrate/Competitorn/a
Meas. Tech.ChEBML_159920
IC50 47±n/a nM
Citation Kozak, KRPrusakiewicz, JJRowlinson, SWMarnett, LJ Enantiospecific, selective cyclooxygenase-2 inhibitors. Bioorg Med Chem Lett12:1315-8 (2002) Prostaglandin G/H synthase 2
Name:Prostaglandin G/H synthase 2
Type:Enzyme
Mol. Mass.:69003.89
Organism:Homo sapiens (Human)
Description:Recombinant Cox-2 provided by Cayman (Cayman Chemical Co.,Ann Arbor, MI).
Residue:604
BDBM50112547
NameBDBM50112547
Synonyms:2-[1-(4-Chloro-benzoyl)-5-methoxy-2-methyl-1H-indol-3-yl]-N-(2-hydroxy-2-phenyl-ethyl)-acetamide | CHEMBL441769
TypeSmall organic molecule
Emp. Form.C27H25ClN2O4
Mol. Mass.476.951
SMILESCOc1ccc2n(C(=O)c3ccc(Cl)cc3)c(C)c(CC(=O)NC[C@@H](O)c3ccccc3)c2c1